{"text_format":"1","workbook":"xlsx","n_sheets":5,"sheets":["Calculator","Data & Calculations","Rates","Rebundled Rates","Changelog"],"not_rendered":{"charts":0,"images":1,"macros":1,"external_links":0,"defined_names":1,"comments":0,"pivot_tables":0},"unopened":[],"bounds":{"document_bytes":16777216,"sheet_cells":100000,"rows_first":2000,"rows_last":500,"rows_between":2000,"halvings":0,"cell_chars":16384,"cell_head_chars":4096},"cells_cut":0,"cells_raw":0,"read":"whole","date_system":"1900"}

{"sheet":"Calculator","index":0,"n_rows":52,"n_cols":9,"rows_kept":52,"cut":false,"hidden":false,"merged":[[51,2,52,8],[3,2,3,7],[7,2,7,7],[30,2,31,8],[34,2,35,8],[41,2,42,8],[18,7,18,8],[19,7,19,8],[20,7,20,8],[21,7,21,8],[22,7,22,8],[37,2,38,8]]}
[]
[]
[null,null,"SVCE Residential Cost Comparison Calculator",null,null,null,null,null,"Updated 7/3/2017"]
[]
[]
[null,null,{"$f":"IF(ISNUMBER(SEARCH(\"-1\",D9)),\"Enter Your Total Monthly Usage (kWh)\",\"\")","v":"Enter Your Total Monthly Usage (kWh)"},null,"Select Your Billing Month","May-Oct"]
[null,null,"                   Enter usage for one summer (May-Oct) or one winter (Nov-Apr) month",null,"           Select which range of months your bill falls in"]
[null,null,"Additional Rate Options"]
[null,null,"Non-Basic Rate Schedule","Basic Residential (E-1)"]
[null,null,{"$f":"IF(VLOOKUP($D$9,Rates!$A$2:$H$14,3,FALSE)=FALSE,\"\",\"Summer Peak Usage (kWh)\")","v":""},null,null,{"$f":"IF(VLOOKUP($D$9,Rates!$A$2:$H$14,6,FALSE)=FALSE,\"\",\"Winter Peak Usage (kWh)\")","v":""}]
[null,null,{"$f":"IF(VLOOKUP($D$9,Rates!$A$2:$H$14,4,FALSE)=FALSE,\"\",\"Summer Partial Peak Usage (kWh)\")","v":""},null,null,{"$f":"IF(VLOOKUP($D$9,Rates!$A$2:$H$14,7,FALSE)=FALSE,\"\",\"Winter Partial Peak Usage (kWh)\")","v":""}]
[null,null,{"$f":"IF(VLOOKUP($D$9,Rates!$A$2:$H$14,5,FALSE)=FALSE,\"\",\"Summer Off Peak Usage (kWh)\")","v":""},null,null,{"$f":"IF(VLOOKUP($D$9,Rates!$A$2:$H$14,8,FALSE)=FALSE,\"\",\"Winter Off Peak Usage (kWh)\")","v":""}]
[]
[null,null,null,null,"Optional Information (Default Values Represent a Typical Customer)"]
[null,null,"Days in Billing Cycle",31,null,"Baseline Territory (click for map)","X"]
[null,null,"Primary Heating Source","Gas",null,"PCIA Vintage (from PG&E Delivery page of your bill)",2017]
[]
[null,null,"                   (usage details can typically be found on the third page of your bill)"]
[null,null,null,null,"SVCE GreenStart","PG&E Service","SVCE GreenPrime"]
[null,null,null,"PG&E Delivery Costs",{"$f":"F20","v":0},{"$f":"IFERROR('Data & Calculations'!B74,0)","v":0},{"$f":"F20","v":0}]
{"$rows_left_out":33}
{"sheet":"Data & Calculations","index":1,"n_rows":77,"n_cols":10,"rows_kept":77,"cut":false,"hidden":true,"merged":[]}
["Determined Bundled Rate (automated)"]
[{"$f":"Calculator!D9","v":"Basic Residential (E-1)"},{"$f":"Rates!B2","v":"All Usage"},{"$f":"Rates!C2","v":"S Pk"},{"$f":"Rates!D2","v":"S Pt"},{"$f":"Rates!E2","v":"S Off"},{"$f":"Rates!F2","v":"W Pk"},{"$f":"Rates!G2","v":"W Pt"},{"$f":"Rates!H2","v":"W Off"},{"$f":"Rates!I2","v":"Meter Charge"},{"$f":"Rates!J2","v":"Minimum Bill"}]
["Tier 1",{"$f":"VLOOKUP(Calculator!$D$9,Rates!$A$3:$AB$16,MATCH(B$2,Rates!$A$2:$J$2,0),FALSE)","v":0.19979},{"$f":"VLOOKUP(Calculator!$D$9,Rates!$A$3:$AB$16,MATCH(C$2,Rates!$A$2:$J$2,0),FALSE)","v":false},{"$f":"VLOOKUP(Calculator!$D$9,Rates!$A$3:$AB$16,MATCH(D$2,Rates!$A$2:$J$2,0),FALSE)","v":false},{"$f":"VLOOKUP(Calculator!$D$9,Rates!$A$3:$AB$16,MATCH(E$2,Rates!$A$2:$J$2,0),FALSE)","v":false},{"$f":"VLOOKUP(Calculator!$D$9,Rates!$A$3:$AB$16,MATCH(F$2,Rates!$A$2:$J$2,0),FALSE)","v":false},{"$f":"VLOOKUP(Calculator!$D$9,Rates!$A$3:$AB$16,MATCH(G$2,Rates!$A$2:$J$2,0),FALSE)","v":false},{"$f":"VLOOKUP(Calculator!$D$9,Rates!$A$3:$AB$16,MATCH(H$2,Rates!$A$2:$J$2,0),FALSE)","v":false},{"$f":"IFERROR(VLOOKUP(Calculator!$D$9,Rates!$A$3:$AB$16,MATCH(I$2,Rates!$A$2:$J$2,0),FALSE),0)","v":0},{"$f":"IFERROR(VLOOKUP(Calculator!$D$9,Rates!$A$3:$AB$16,MATCH(J2,Rates!$A$2:$J$2,0),FALSE),0)","v":0.32854}]
["Tier 2",{"$f":"VLOOKUP(Calculator!$D$9,Rates!$A$3:$AB$16,MATCH(B$2,Rates!$A$2:$J$2,0)+10,FALSE)","v":0.27611999999999998},{"$f":"VLOOKUP(Calculator!$D$9,Rates!$A$3:$AB$16,MATCH(C$2,Rates!$A$2:$J$2,0)+10,FALSE)","v":false},{"$f":"VLOOKUP(Calculator!$D$9,Rates!$A$3:$AB$16,MATCH(D$2,Rates!$A$2:$J$2,0)+10,FALSE)","v":false},{"$f":"VLOOKUP(Calculator!$D$9,Rates!$A$3:$AB$16,MATCH(E$2,Rates!$A$2:$J$2,0)+10,FALSE)","v":false},{"$f":"VLOOKUP(Calculator!$D$9,Rates!$A$3:$AB$16,MATCH(F$2,Rates!$A$2:$J$2,0)+10,FALSE)","v":false},{"$f":"VLOOKUP(Calculator!$D$9,Rates!$A$3:$AB$16,MATCH(G$2,Rates!$A$2:$J$2,0)+10,FALSE)","v":false},{"$f":"VLOOKUP(Calculator!$D$9,Rates!$A$3:$AB$16,MATCH(H$2,Rates!$A$2:$J$2,0)+10,FALSE)","v":false}]
["Tier 3",{"$f":"VLOOKUP(Calculator!$D$9,Rates!$A$3:$AB$16,MATCH(B$2,Rates!$A$2:$J$2,0)+19,FALSE)","v":0.40139000000000002},{"$f":"VLOOKUP(Calculator!$D$9,Rates!$A$3:$AB$16,MATCH(C$2,Rates!$A$2:$J$2,0)+19,FALSE)","v":false},{"$f":"VLOOKUP(Calculator!$D$9,Rates!$A$3:$AB$16,MATCH(D$2,Rates!$A$2:$J$2,0)+19,FALSE)","v":false},{"$f":"VLOOKUP(Calculator!$D$9,Rates!$A$3:$AB$16,MATCH(E$2,Rates!$A$2:$J$2,0)+19,FALSE)","v":false},{"$f":"VLOOKUP(Calculator!$D$9,Rates!$A$3:$AB$16,MATCH(F$2,Rates!$A$2:$J$2,0)+19,FALSE)","v":false},{"$f":"VLOOKUP(Calculator!$D$9,Rates!$A$3:$AB$16,MATCH(G$2,Rates!$A$2:$J$2,0)+19,FALSE)","v":false},{"$f":"VLOOKUP(Calculator!$D$9,Rates!$A$3:$AB$16,MATCH(H$2,Rates!$A$2:$J$2,0)+19,FALSE)","v":false}]
[]
["Determined Bundled Charges (automated)"]
[{"$f":"A2","v":"Basic Residential (E-1)"},"All Usage","S Pk","S Pt","S Off","W Pk","W Pt","W Off","Meter Charge","Total"]
[{"$f":"A3","v":"Tier 1"},{"$f":"B3*C64","v":{"$error":"#DIV/0!"}},{"$error":"#DIV/0!"},{"$error":"#DIV/0!"},{"$error":"#DIV/0!"},{"$error":"#DIV/0!"},{"$error":"#DIV/0!"},{"$error":"#DIV/0!"},{"$f":"I3*Calculator!D15","v":0}]
[{"$f":"A4","v":"Tier 2"},{"$error":"#DIV/0!"},{"$error":"#DIV/0!"},{"$error":"#DIV/0!"},{"$error":"#DIV/0!"},{"$error":"#DIV/0!"},{"$error":"#DIV/0!"},{"$error":"#DIV/0!"}]
[{"$f":"A5","v":"Tier 3"},{"$error":"#DIV/0!"},{"$error":"#DIV/0!"},{"$error":"#DIV/0!"},{"$error":"#DIV/0!"},{"$error":"#DIV/0!"},{"$error":"#DIV/0!"},{"$error":"#DIV/0!"}]
["Total",{"$f":"SUM(B9:B11)","v":{"$error":"#DIV/0!"}},{"$error":"#DIV/0!"},{"$error":"#DIV/0!"},{"$error":"#DIV/0!"},{"$error":"#DIV/0!"},{"$error":"#DIV/0!"},{"$error":"#DIV/0!"},{"$f":"IFERROR(SUM(I9:I11),0)","v":0},{"$f":"SUM(B12:I12)","v":{"$error":"#DIV/0!"}}]
[]
["Determined Generation Rates (automated)"]
[{"$f":"A2","v":"Basic Residential (E-1)"},"All Usage","S Pk","S Pt","S Off","W Pk","W Pt","W Off","NEM Bonus"]
["PGE",{"$f":"VLOOKUP(Calculator!$D$9,Rates!$A$21:$H$34,MATCH(B$15,Rates!$A$2:$J$2,0),FALSE)","v":9.8379999999999995E-2},{"$f":"VLOOKUP(Calculator!$D$9,Rates!$A$21:$H$34,MATCH(C$15,Rates!$A$2:$J$2,0),FALSE)","v":false},{"$f":"VLOOKUP(Calculator!$D$9,Rates!$A$21:$H$34,MATCH(D$15,Rates!$A$2:$J$2,0),FALSE)","v":false},{"$f":"VLOOKUP(Calculator!$D$9,Rates!$A$21:$H$34,MATCH(E$15,Rates!$A$2:$J$2,0),FALSE)","v":false},{"$f":"VLOOKUP(Calculator!$D$9,Rates!$A$21:$H$34,MATCH(F$15,Rates!$A$2:$J$2,0),FALSE)","v":false},{"$f":"VLOOKUP(Calculator!$D$9,Rates!$A$21:$H$34,MATCH(G$15,Rates!$A$2:$J$2,0),FALSE)","v":false},{"$f":"VLOOKUP(Calculator!$D$9,Rates!$A$21:$H$34,MATCH(H$15,Rates!$A$2:$J$2,0),FALSE)","v":false}]
["SVCE",{"$f":"VLOOKUP(Calculator!$D$9,Rates!$A$37:$H$50,MATCH(B$15,Rates!$A$2:$J$2,0),FALSE)","v":6.7629999999999996E-2},{"$f":"VLOOKUP(Calculator!$D$9,Rates!$A$37:$H$50,MATCH(C$15,Rates!$A$2:$J$2,0),FALSE)","v":false},{"$f":"VLOOKUP(Calculator!$D$9,Rates!$A$37:$H$50,MATCH(D$15,Rates!$A$2:$J$2,0),FALSE)","v":false},{"$f":"VLOOKUP(Calculator!$D$9,Rates!$A$37:$H$50,MATCH(E$15,Rates!$A$2:$J$2,0),FALSE)","v":false},{"$f":"VLOOKUP(Calculator!$D$9,Rates!$A$37:$H$50,MATCH(F$15,Rates!$A$2:$J$2,0),FALSE)","v":false},{"$f":"VLOOKUP(Calculator!$D$9,Rates!$A$37:$H$50,MATCH(G$15,Rates!$A$2:$J$2,0),FALSE)","v":false},{"$f":"VLOOKUP(Calculator!$D$9,Rates!$A$37:$H$50,MATCH(H$15,Rates!$A$2:$J$2,0),FALSE)","v":false},{"$f":"B69","v":8.0000000000000002E-3}]
[]
["Determined Generation Charges (automated)"]
[{"$f":"A2","v":"Basic Residential (E-1)"},"All Usage","S Pk","S Pt","S Off","W Pk","W Pt","W Off","NEM Bonus","Total"]
{"$rows_left_out":58}
{"sheet":"Rates","index":2,"n_rows":48,"n_cols":27,"rows_kept":48,"cut":false,"hidden":true,"merged":[]}
["Bundled Rate"]
["Tier 1","All Usage","S Pk","S Pt","S Off","W Pk","W Pt","W Off","Meter Charge","Minimum Bill","Tier 2","All Usage","S Pk","S Pt","S Off","W Pk","W Pt","W Off",null,"High Usage","All Usage","S Pk","S Pt","S Off","W Pk","W Pt","W Off"]
["Basic Residential (E-1)",0.19979,false,false,false,false,false,false,null,0.32854,{"$f":"A3","v":"Basic Residential (E-1)"},0.27611999999999998,false,false,false,false,false,false,null,{"$f":"K3","v":"Basic Residential (E-1)"},0.40139000000000002,false,false,false,false,false,false]
["Basic CARE Res. (EL-1)",0.12642999999999999,false,false,false,false,false,false,null,0.16427,{"$f":"A4","v":"Basic CARE Res. (EL-1)"},0.17261000000000001,false,false,false,false,false,false,null,"Basic CARE Res. (EL-1)",0.2397,false,false,false,false,false,false]
["E-TOU-A",{"$f":"L5","v":false},{"$f":"M5+D17","v":0.30506},{"$f":"N5","v":false},{"$f":"O5+D17","v":0.22948000000000002},{"$f":"P5+D17","v":0.18709000000000003},false,{"$f":"R5+D17","v":0.17279},null,{"$f":"J3","v":0.32854},{"$f":"A5","v":"E-TOU-A"},false,0.39335999999999999,false,0.31778000000000001,0.27539000000000002,false,0.26108999999999999,null,"E-TOU-A",false,0.39335999999999999,false,0.31778000000000001,0.27539000000000002,false,0.26108999999999999]
["E-TOU-B",{"$f":"L6","v":false},{"$f":"M6","v":0.36335000000000001},false,0.26029000000000002,0.22588,false,0.20707999999999999,null,{"$f":"J3","v":0.32854},"E-TOU-B",false,0.36335000000000001,false,0.26029000000000002,0.22588,false,0.20707999999999999,null,"E-TOU-B",false,0.36335000000000001,false,0.26029000000000002,0.22588,false,0.20707999999999999]
["EL-TOU-A (CARE)",{"$f":"L7","v":false},{"$f":"M7+D18","v":0.18906000000000001},false,{"$f":"O7+D18","v":0.14144000000000001},{"$f":"P7+D18","v":0.11474000000000001},false,{"$f":"R7+D18","v":0.10572999999999999},null,{"$f":"J4","v":0.16427},"EL-TOU-A (CARE)",false,0.23685,false,0.18923000000000001,0.16253000000000001,false,0.15351999999999999,null,"EL-TOU-A (CARE)",false,0.23685,false,0.18923000000000001,0.16253000000000001,false,0.15351999999999999]
["EL-TOU-B (CARE)",false,0.22162999999999999,false,0.15670000000000001,0.13502,false,0.12317,null,{"$f":"J4","v":0.16427},"EL-TOU-B (CARE)",false,0.22162999999999999,false,0.15670000000000001,0.13502,false,0.12317,null,"EL-TOU-B (CARE)",false,0.22162999999999999,false,0.15670000000000001,0.13502,false,0.12317]
["EV-A",false,0.45389000000000002,0.24986,0.12225,0.32018000000000002,0.19794,0.12503,null,{"$f":"J3","v":0.32854},"EV-A",false,0.45389000000000002,0.24986,0.12225,0.32018000000000002,0.19794,0.12503,null,"EV-A",false,0.45389000000000002,0.24986,0.12225,0.32018000000000002,0.19794,0.12503]
["EV-B",false,0.44738,0.24660000000000001,0.12179,0.31324999999999997,0.19447,0.12453,4.9279999999999997E-2,{"$f":"J3","v":0.32854},"EV-B",false,0.44738,0.24660000000000001,0.12179,0.31324999999999997,0.19447,0.12453,null,"EV-B",false,0.44738,0.24660000000000001,0.12179,0.31324999999999997,0.19447,0.12453]
[]
[{"$f":"\"--- Closed Rates ---\"","v":"--- Closed Rates ---"},null,null,null,null,null,null,null,null,null,{"$f":"A12","v":"--- Closed Rates ---"},null,null,null,null,null,null,null,null,{"$f":"K12","v":"--- Closed Rates ---"}]
["E-6 (Time-of-Use)",false,0.35932999999999998,0.24406,0.16728000000000001,false,0.18845000000000001,0.17161999999999999,0.25297999999999998,{"$f":"J3","v":0.32854},"E-6 (Time-of-Use)",false,0.43565999999999999,0.32039000000000001,0.24362,false,0.26478000000000002,0.24795,null,{"$f":"K13","v":"E-6 (Time-of-Use)"},false,{"$f":"M13","v":0.43565999999999999},{"$f":"N13","v":0.32039000000000001},0.24362,false,0.26478000000000002,0.24795]
["EL-6 (CARE, Time-of-Use)",false,0.24323,0.15873000000000001,0.10245,false,0.11797000000000001,0.10562000000000001,0.20238,{"$f":"J4","v":0.16427},"EL-6 (CARE, Time-of-Use)",false,0.29049000000000003,0.20599000000000001,0.14971000000000001,false,0.16521,0.15287000000000001,null,{"$f":"K14","v":"EL-6 (CARE, Time-of-Use)"},false,{"$f":"M14","v":0.29049000000000003},{"$f":"N14","v":0.20599000000000001},{"$f":"O14","v":0.14971000000000001},false,{"$f":"Q14","v":0.16521},{"$f":"R14","v":0.15287000000000001}]
[]
[]
["Baseline Credit (E-TOU only)",null,null,-8.8300000000000003E-2]
["Baseline Credit (EL-TOU only)",null,null,-4.7789999999999999E-2]
[]
["PG&E Generation Rate","All Usage",{"$f":"C2","v":"S Pk"},"S Pt","S Off","W Pk","W Pt","W Off"]
{"$rows_left_out":29}
{"sheet":"Rebundled Rates","index":3,"n_rows":51,"n_cols":14,"rows_kept":51,"cut":false,"hidden":true,"merged":[[42,0,42,13],[43,3,43,6],[43,10,43,13],[20,10,20,13],[20,3,20,6],[26,3,26,6],[26,10,26,13],[34,3,34,6],[34,10,34,13],[1,3,1,6],[0,1,0,6],[0,8,0,13],[1,10,1,13],[6,3,6,6],[6,10,6,13]]}
[null,"Rates for Usage",null,null,null,null,null,null,"Rates for Surplus Generation (Excess NEM Credits at billing date)"]
[{"$f":"Rates!A3","v":"Basic Residential (E-1)"},"MCE Rebundled","PG&E Bundled","Result",null,null,null,null,"MCE Rebundled","PG&E Bundled","Result"]
["Up to Baseline",{"$f":"C3-VLOOKUP($A$2,Rates!$A$20:$H$33,2,0)+VLOOKUP($A$2,Rates!$A$36:$H$49,2,0)+VLOOKUP(MAX('Data & Calculations'!$A$35:$A$46),'Data & Calculations'!$A$35:$D$46,4,0)","v":0.19880999999999999},{"$f":"VLOOKUP(A$2,Rates!$A$2:$AB$18,2,0)","v":0.19979},"MCE's rate is",{"$f":"IF(B3<C3,\"lower by\",\"higher by\")","v":"lower by"},{"$f":"ABS(C3-B3)","v":9.8000000000000864E-4},"per kWh",null,{"$f":"B3+0.01","v":0.20881},{"$f":"C3","v":0.19979},"MCE's rate is",{"$f":"IF(I3<J3,\"lower by\",\"higher by\")","v":"higher by"},{"$f":"ABS(J3-I3)","v":9.0200000000000002E-3},"per kWh"]
["100%-200% of Baseline",{"$f":"C4-VLOOKUP($A$2,Rates!$A$20:$H$33,2,0)+VLOOKUP($A$2,Rates!$A$36:$H$49,2,0)+VLOOKUP(MAX('Data & Calculations'!$A$35:$A$46),'Data & Calculations'!$A$35:$D$46,4,0)","v":0.27514},{"$f":"VLOOKUP(A$2,Rates!$A$2:$AB$18,12,0)","v":0.27611999999999998},"MCE's rate is",{"$f":"IF(B4<C4,\"lower by\",\"higher by\")","v":"lower by"},{"$f":"ABS(C4-B4)","v":9.7999999999998089E-4},"per kWh",null,{"$f":"B4+0.01","v":0.28514},{"$f":"C4","v":0.27611999999999998},"MCE's rate is",{"$f":"IF(I4<J4,\"lower by\",\"higher by\")","v":"higher by"},{"$f":"ABS(J4-I4)","v":9.020000000000028E-3},"per kWh"]
["Over 200% of Baseline",{"$f":"C5-VLOOKUP($A$2,Rates!$A$20:$H$33,2,0)+VLOOKUP($A$2,Rates!$A$36:$H$49,2,0)+VLOOKUP(MAX('Data & Calculations'!$A$35:$A$46),'Data & Calculations'!$A$35:$D$46,4,0)","v":0.40040999999999999},{"$f":"VLOOKUP(A$2,Rates!$A$2:$AB$18,21,0)","v":0.40139000000000002},"MCE's rate is","lower by",9.800000000000364E-4,"per kWh",null,0.41041,0.40139000000000002,"MCE's rate is","higher by",9.0199999999999725E-3,"per kWh"]
[]
[{"$f":"Rates!A5","v":"E-TOU-A"},"MCE Rebundled","PG&E Bundled","Result",null,null,null,null,"MCE Rebundled","PG&E Bundled","Result"]
["Summer Peak"]
["… up to Baseline",{"$f":"C9-VLOOKUP($A$7,Rates!$A$20:$H$33,3,0)+VLOOKUP($A$7,Rates!$A$36:$H$49,3,0)+VLOOKUP(MAX('Data & Calculations'!$A$35:$A$46),'Data & Calculations'!$A$35:$D$46,4,0)","v":0.30423},{"$f":"VLOOKUP(A$7,Rates!$A$2:$AB$18,3,0)","v":0.30506},"MCE's rate is",{"$f":"IF(B9<C9,\"lower by\",\"higher by\")","v":"lower by"},{"$f":"ABS(C9-B9)","v":8.2999999999999741E-4},"per kWh",null,{"$f":"B9+0.01","v":0.31423000000000001},{"$f":"C9","v":0.30506},"MCE's rate is",{"$f":"IF(I9<J9,\"lower by\",\"higher by\")","v":"higher by"},{"$f":"ABS(J9-I9)","v":9.1700000000000115E-3},"per kWh"]
["… above Baseline",{"$f":"C10-VLOOKUP($A$7,Rates!$A$20:$H$33,3,0)+VLOOKUP($A$7,Rates!$A$36:$H$49,3,0)+VLOOKUP(MAX('Data & Calculations'!$A$35:$A$46),'Data & Calculations'!$A$35:$D$46,4,0)","v":0.39252999999999999},{"$f":"VLOOKUP(A$7,Rates!$A$2:$AB$18,13,0)","v":0.39335999999999999},"MCE's rate is","lower by",8.2999999999999741E-4,"per kWh",null,{"$f":"B10+0.01","v":0.40253},{"$f":"C10","v":0.39335999999999999},"MCE's rate is","higher by",9.1700000000000115E-3,"per kWh"]
["Summer Off Peak"]
["… up to Baseline",{"$f":"C12-VLOOKUP($A$7,Rates!$A$20:$H$33,5,0)+VLOOKUP($A$7,Rates!$A$36:$H$49,5,0)+VLOOKUP(MAX('Data & Calculations'!$A$35:$A$46),'Data & Calculations'!$A$35:$D$46,4,0)","v":0.22940000000000002},{"$f":"VLOOKUP(A$7,Rates!$A$2:$AB$18,5,0)","v":0.22948000000000002},"MCE's rate is",{"$f":"IF(B12<C12,\"lower by\",\"higher by\")","v":"lower by"},{"$f":"ABS(C12-B12)","v":7.999999999999674E-5},"per kWh",null,{"$f":"B12+0.01","v":0.23940000000000003},{"$f":"C12","v":0.22948000000000002},"MCE's rate is","higher by",9.9200000000000121E-3,"per kWh"]
["… above Baseline",{"$f":"C13-VLOOKUP($A$7,Rates!$A$20:$H$33,5,0)+VLOOKUP($A$7,Rates!$A$36:$H$49,5,0)+VLOOKUP(MAX('Data & Calculations'!$A$35:$A$46),'Data & Calculations'!$A$35:$D$46,4,0)","v":0.31770000000000004},{"$f":"VLOOKUP(A$7,Rates!$A$2:$AB$18,15,0)","v":0.31778000000000001},"MCE's rate is","lower by",7.9999999999968985E-5,"per kWh",null,{"$f":"B13+0.01","v":0.32770000000000005},{"$f":"C13","v":0.31778000000000001},"MCE's rate is","higher by",9.9200000000000399E-3,"per kWh"]
["Winter Peak"]
["… up to Baseline",{"$f":"C15-VLOOKUP($A$7,Rates!$A$20:$H$33,6,0)+VLOOKUP($A$7,Rates!$A$36:$H$49,6,0)+VLOOKUP(MAX('Data & Calculations'!$A$35:$A$46),'Data & Calculations'!$A$35:$D$46,4,0)","v":0.18713000000000005},{"$f":"VLOOKUP(A$7,Rates!$A$2:$AB$18,6,0)","v":0.18709000000000003},"MCE's rate is","higher by",4.0000000000012248E-5,"per kWh",null,{"$f":"B15+0.01","v":0.19713000000000006},{"$f":"C15","v":0.18709000000000003},"MCE's rate is","higher by",1.0040000000000021E-2,"per kWh"]
["… above Baseline",{"$f":"C16-VLOOKUP($A$7,Rates!$A$20:$H$33,6,0)+VLOOKUP($A$7,Rates!$A$36:$H$49,6,0)+VLOOKUP(MAX('Data & Calculations'!$A$35:$A$46),'Data & Calculations'!$A$35:$D$46,4,0)","v":0.27543000000000001},{"$f":"VLOOKUP(A$7,Rates!$A$2:$AB$18,16,0)","v":0.27539000000000002},"MCE's rate is","higher by",3.9999999999984492E-5,"per kWh",null,{"$f":"B16+0.01","v":0.28543000000000002},{"$f":"C16","v":0.27539000000000002},"MCE's rate is","higher by",1.0039999999999993E-2,"per kWh"]
["Winter Off Peak"]
["… up to Baseline",{"$f":"C18-VLOOKUP($A$7,Rates!$A$20:$H$33,8,0)+VLOOKUP($A$7,Rates!$A$36:$H$49,8,0)+VLOOKUP(MAX('Data & Calculations'!$A$35:$A$46),'Data & Calculations'!$A$35:$D$46,4,0)","v":0.17296999999999998},{"$f":"VLOOKUP(A$7,Rates!$A$2:$AB$18,8,0)","v":0.17279},"MCE's rate is","higher by",1.7999999999998573E-4,"per kWh",null,{"$f":"B18+0.01","v":0.18296999999999999},{"$f":"C18","v":0.17279},"MCE's rate is","higher by",1.0179999999999995E-2,"per kWh"]
["… above Baseline",{"$f":"C19-VLOOKUP($A$7,Rates!$A$20:$H$33,8,0)+VLOOKUP($A$7,Rates!$A$36:$H$49,8,0)+VLOOKUP(MAX('Data & Calculations'!$A$35:$A$46),'Data & Calculations'!$A$35:$D$46,4,0)","v":0.26127},{"$f":"VLOOKUP(A$7,Rates!$A$2:$AB$18,18,0)","v":0.26108999999999999},"MCE's rate is","higher by",1.8000000000001348E-4,"per kWh",null,{"$f":"B19+0.01","v":0.27127000000000001},{"$f":"C19","v":0.26108999999999999},"MCE's rate is","higher by",1.0180000000000022E-2,"per kWh"]
[]
{"$rows_left_out":32}
{"sheet":"Changelog","index":4,"n_rows":11,"n_cols":2,"rows_kept":11,"cut":false,"hidden":true,"merged":[]}
["Date","Change"]
["2016-04-29","Beta version completed, to staff for review."]
["2016-05-04","Cosmetic Changes"]
[null,"Corrected EV rate description"]
[null,"Hid and locked cell editing for public use to restrict potentially breaking calculations"]
["2016-05-23","Replaced IFNA command with IFERROR; IFNA is not well supported in Excel. May need to replace with IF(ISERROR()) later."]
["2016-11-15","Rebundled Rates Added"]
["2017-01-03","Updated for PG&E AET"]
["2017-03-01","Changes for PG&E 3/1 change (tiers, etc)"]
[null,"Updated Local Sol implementation date"]
[null,"Added MCE 4/1 Rates"]