{"text_format":"1","workbook":"xlsx","n_sheets":7,"sheets":["Cost Comparison","Calculation","Rates","PCIA  FF","CARE","Rebundled Rates","Changelog"],"not_rendered":{"charts":0,"images":1,"macros":1,"external_links":0,"defined_names":1,"comments":1,"pivot_tables":0},"unopened":[],"bounds":{"document_bytes":16777216,"sheet_cells":100000,"rows_first":2000,"rows_last":500,"rows_between":2000,"halvings":0,"cell_chars":16384,"cell_head_chars":4096},"cells_cut":0,"cells_raw":0,"read":"whole","date_system":"1900"}

{"sheet":"Cost Comparison","index":0,"n_rows":64,"n_cols":20,"rows_kept":64,"cut":false,"hidden":false,"merged":[[34,13,36,19],[45,1,46,15]]}
[]
[null,"SVCE Business Cost Comparison Calculator",null,null,null,null,null,null,null,null,null,null,null,null,null,null,null,null,null,"Updated 7/3/17"]
[]
[null,"Required Information",null,null,null,null,null,null,null,null,null,null,null,"Optional Information"]
[null,"Your Rate"]
[null,"A1 (COM-1)"]
[]
[null,"Your Usage"]
[null,null,null,null,null,null,null,"SUMMER",null,null,null,"WINTER"]
[null,{"$f":"IF(VLOOKUP(B6,Rates!A:AA,2,0)=FALSE,\"\",\"One Month of Usage:\")","v":""},null,null,null,"Summer Billing Period (days):",null,null,null," Winter Billing Period (days):"]
{"$rows_left_out":55}
{"sheet":"Calculation","index":1,"n_rows":44,"n_cols":8,"rows_kept":44,"cut":false,"hidden":true,"merged":[]}
["Normalized PCIA",{"$f":"'Cost Comparison'!R11","v":2017},null,null,null,null,"PCIA Charge",{"$f":"IFERROR(B2*E3,0)","v":0}]
["PCIA Rate",{"$f":"VLOOKUP(E2,'PCIA  FF'!A2:T12,MATCH(B1,'PCIA  FF'!1:1,0),FALSE)","v":2.1989999999999999E-2},null,"PCIA Class",{"$f":"VLOOKUP('Cost Comparison'!B6,Rates!$A$74:$S$104,19,0)","v":"A1"}]
["FF Rate",{"$f":"IF('Cost Comparison'!$R$12=\"No\",VLOOKUP(E2,'PCIA  FF'!A14:T24,MATCH(B1,'PCIA  FF'!14:14,0),FALSE),0)","v":6.4999999999999997E-4},null,"Usage Eligible",{"$f":"SUMIF(C7:C15,\"<>FALSE\",B7:B15)","v":0},null,"FF Charge",{"$f":"E3*B3","v":0}]
[]
["Bundled Rate Components"]
[null,"kWh/KW","Bundled Rate","Bundled Charge","PG&E Gen Rate","PG&E Gen Charge","SVCEA Gen Rate","SVCEA Gen Charge"]
["Non-sea/non-tou",{"$f":"'Cost Comparison'!D10","v":0},{"$f":"VLOOKUP('Cost Comparison'!$B$6,Rates!$A$2:$W$33,2,0)","v":false},{"$f":"B7*C7","v":0},{"$f":"VLOOKUP('Cost Comparison'!$B$6,Rates!$A$38:$W$71,2,0)","v":false},{"$f":"B7*E7","v":0},{"$f":"VLOOKUP('Cost Comparison'!$B$6,Rates!$A$73:$W$106,2,0)","v":false},{"$f":"G7*B7","v":0}]
["Summer seasonal",{"$f":"'Cost Comparison'!H11","v":0},{"$f":"VLOOKUP('Cost Comparison'!$B$6,Rates!$A$2:$W$33,3,0)","v":0.24729999999999999},0,{"$f":"VLOOKUP('Cost Comparison'!$B$6,Rates!$A$38:$W$71,3,0)","v":0.11518},0,{"$f":"VLOOKUP('Cost Comparison'!$B$6,Rates!$A$73:$W$106,3,0)","v":9.1389999999999999E-2},0]
["Winter Seasonal",{"$f":"'Cost Comparison'!L11","v":0},{"$f":"VLOOKUP('Cost Comparison'!$B$6,Rates!$A$2:$W$33,4,0)","v":0.19270000000000001},0,{"$f":"VLOOKUP('Cost Comparison'!$B$6,Rates!$A$38:$W$71,4,0)","v":7.9240000000000005E-2},0,{"$f":"VLOOKUP('Cost Comparison'!$B$6,Rates!$A$73:$W$106,4,0)","v":5.5809999999999998E-2},0]
["Summer Peak",{"$f":"'Cost Comparison'!H15","v":0},{"$f":"VLOOKUP('Cost Comparison'!$B$6,Rates!$A$2:$W$33,5,0)","v":false},0,{"$f":"VLOOKUP('Cost Comparison'!$B$6,Rates!$A$38:$W$71,5,0)","v":false},0,{"$f":"VLOOKUP('Cost Comparison'!$B$6,Rates!$A$73:$W$106,5,0)","v":false},0]
{"$rows_left_out":35}
{"sheet":"Rates","index":2,"n_rows":104,"n_cols":22,"rows_kept":104,"cut":false,"hidden":true,"merged":[]}
["Bundled Charges",null,"Flat Rate Options",null,"TOU Rate Options",null,null,null,null,null,"Demand Charges",null,null,null,null,null,null,null,"Per Meter/Day"]
["Rate Schedules","All Usage","Summer","Winter","Summer Peak","Summer Partial Peak","Summer Off Peak","Winter Peak","Winter Partial Peak","Winter Off Peak","Summer Peak","Summer Partial Peak","Summer Maximum","Winter Off Peak","Winter Partial","Winter Maximum","Conn. Load Sum.","Conn. Load Win.","Single-phase","Poly-phase","Voluntary","Mandatory"]
["A1 (COM-1)",false,0.24729999999999999,0.19270000000000001,false,false,false,false,false,false,false,false,false,false,false,false,false,false,0.32854,0.65708,false,false]
["A1X (COM-1 TOU)",false,false,false,0.26297999999999999,0.23932999999999999,0.21196999999999999,false,0.22047,0.19955999999999999,false,false,false,false,false,false,false,false,{"$f":"S3","v":0.32854},{"$f":"T3","v":0.65708},false,false]
["A6 (COM-6)",false,false,false,0.55478000000000005,0.25796000000000002,0.18637999999999999,false,0.20441999999999999,0.18618000000000001,false,false,false,false,false,false,false,false,{"$f":"S3","v":0.32854},{"$f":"T3","v":0.65708},false,false]
["A10A (COM-10)",false,0.16286,0.12626000000000001,false,false,false,false,false,false,false,false,18.260000000000002,false,false,10.93,false,false,4.5995900000000001,{"$f":"S6","v":4.5995900000000001},false,false]
["A10B (COM-10-TOU)",false,false,false,0.21765999999999999,0.16253000000000001,0.13446,false,0.13435,0.11729000000000001,false,false,{"$f":"M6","v":18.260000000000002},false,false,{"$f":"P6","v":10.93},false,false,{"$f":"S6","v":4.5995900000000001},{"$f":"T6","v":4.5995900000000001},false,false]
["E19S (COM-19S)",false,false,false,0.15178,0.11126999999999999,8.4449999999999997E-2,false,0.10573,9.1109999999999997E-2,18.64,5.18,17.559999999999999,false,0.12,17.559999999999999,false,false,false,false,{"$f":"S6","v":4.5995900000000001},19.712530000000001]
["E19P (COM-19P)",false,false,false,0.14165,0.10327,7.8600000000000003E-2,false,9.8089999999999997E-2,8.4690000000000001E-2,16.600000000000001,4.53,14.4,false,0.15,14.4,false,false,false,false,{"$f":"U8","v":4.5995900000000001},{"$f":"V8","v":19.712530000000001}]
["E19T (COM-19T)",false,false,false,0.10559,9.2979999999999993E-2,7.6310000000000003E-2,false,9.4969999999999999E-2,8.2159999999999997E-2,12.42,3.11,9.1300000000000008,false,0,9.1300000000000008,false,false,false,false,{"$f":"U7","v":false},{"$f":"V7","v":false}]
{"$rows_left_out":95}
{"sheet":"PCIA  FF","index":3,"n_rows":36,"n_cols":15,"rows_kept":36,"cut":false,"hidden":true,"merged":[]}
["PCIA",null,2009,2010,2011,2012,2013,2014,2015,2016,2017,null,null,"Error-checking and debugging:"]
["Residential",null,null,null,null,null,null,null,null,null,null,null,null,"Min","Max"]
["A1",null,1.8610000000000002E-2,2.112E-2,2.2009999999999998E-2,2.2710000000000001E-2,2.2599999999999999E-2,2.2210000000000001E-2,2.1909999999999999E-2,2.1989999999999999E-2,2.1989999999999999E-2,null,null,{"$f":"MIN(C3:K3)","v":1.8610000000000002E-2},{"$f":"MAX(C3:K3)","v":2.2710000000000001E-2}]
["A10",null,1.9060000000000001E-2,2.163E-2,2.2550000000000001E-2,2.3259999999999999E-2,2.315E-2,2.2759999999999999E-2,2.2450000000000001E-2,2.2530000000000001E-2,2.2530000000000001E-2,null,null,{"$f":"MIN(C4:K4)","v":1.9060000000000001E-2},{"$f":"MAX(C4:K4)","v":2.3259999999999999E-2}]
["E19",null,1.5980000000000001E-2,1.814E-2,1.89E-2,1.95E-2,1.941E-2,1.908E-2,1.882E-2,1.8890000000000001E-2,1.8890000000000001E-2,null,null,1.5980000000000001E-2,1.95E-2]
["Streelights",null,3.5899999999999999E-3,4.0699999999999998E-3,4.2399999999999998E-3,4.3699999999999998E-3,4.3499999999999997E-3,4.28E-3,4.2199999999999998E-3,4.2399999999999998E-3,4.2399999999999998E-3,null,null,3.5899999999999999E-3,4.3699999999999998E-3]
["Standby",null,8.6499999999999997E-3,9.8099999999999993E-3,1.023E-2,1.055E-2,1.0500000000000001E-2,1.0319999999999999E-2,1.018E-2,1.022E-2,1.022E-2,null,null,8.6499999999999997E-3,1.055E-2]
["Agriculture",null,1.806E-2,2.0490000000000001E-2,2.1360000000000001E-2,2.2030000000000001E-2,2.1930000000000002E-2,2.1559999999999999E-2,2.1260000000000001E-2,2.1340000000000001E-2,2.1340000000000001E-2,null,null,1.806E-2,2.2030000000000001E-2]
["E20T",null,1.2970000000000001E-2,1.472E-2,1.5339999999999999E-2,1.5820000000000001E-2,1.575E-2,1.5480000000000001E-2,1.5270000000000001E-2,1.532E-2,1.532E-2,null,null,1.2970000000000001E-2,1.5820000000000001E-2]
["E20P",null,1.422E-2,1.6140000000000002E-2,1.6820000000000002E-2,1.7350000000000001E-2,1.7270000000000001E-2,1.6969999999999999E-2,1.6740000000000001E-2,1.6799999999999999E-2,1.6799999999999999E-2,null,null,1.422E-2,1.7350000000000001E-2]
{"$rows_left_out":27}
{"sheet":"CARE","index":4,"n_rows":7,"n_cols":7,"rows_kept":7,"cut":false,"hidden":true,"merged":[]}
["Commercial Care Discounts",null,null,null,null,"CARE Ind?",{"$f":"'Cost Comparison'!R14","v":"No"}]
[null,null,"Usage","Discount",null,"Eligible Usage",{"$f":"Calculation!E3","v":0}]
["A1",7.8939999999999996E-2,{"$f":"IF(AND($G$1=\"Yes\",Calculation!$E$2=CARE!$A3,'Cost Comparison'!B6<>\"TC-1\"),Calculation!$E$3,0)","v":0},{"$f":"B3*C3","v":0}]
["A6",7.6280000000000001E-2,{"$f":"IF(AND($G$1=\"Yes\",Calculation!$E$2=CARE!$A4),Calculation!$E$3,0)","v":0},{"$f":"B4*C4","v":0}]
["A10",7.0660000000000001E-2,{"$f":"IF(AND($G$1=\"Yes\",Calculation!$E$2=CARE!$A5),Calculation!$E$3,0)","v":0},{"$f":"B5*C5","v":0}]
["E19",6.2619999999999995E-2,{"$f":"IF(AND($G$1=\"Yes\",Calculation!$E$2=CARE!$A6),Calculation!$E$3,0)","v":0},{"$f":"B6*C6","v":0}]
["E20",5.1450000000000003E-2,{"$f":"IF(AND($G$1=\"Yes\",Calculation!$E$2=CARE!$A7),Calculation!$E$3,0)","v":0},0]

{"sheet":"Rebundled Rates","index":5,"n_rows":20,"n_cols":8,"rows_kept":20,"cut":false,"hidden":true,"merged":[[1,2,1,5]]}
[]
[null,"A1X (COM-1 TOU)","MCE",null,null,null,"PG&E","Overall"]
[null,"Season","MCE Gen.","PG&E Delivery","PG&E Fees","Effective Rate","PG&E Rate","% Diff."]
["Non-Seasonal","All Usage",{"$f":"IF(INDEX(Rates!$A$73:$J$106,MATCH($B$2,Rates!$A$73:$A$106,0),MATCH('Rebundled Rates'!B4,Rates!$2:$2,0))=FALSE,\"\",INDEX(Rates!$A$73:$J$106,MATCH($B$2,Rates!$A$73:$A$106,0),MATCH('Rebundled Rates'!B4,Rates!$2:$2,0)))","v":""},{"$f":"IF(INDEX(Rates!$A$38:$J$69,MATCH('Rebundled Rates'!$B$2,Rates!$A$2:$A$35,0),MATCH('Rebundled Rates'!B4,Rates!$2:$2,0))=FALSE,\"\",G4-INDEX(Rates!$A$38:$J$69,MATCH('Rebundled Rates'!$B$2,Rates!$A$2:$A$35,0),MATCH('Rebundled Rates'!B4,Rates!$2:$2,0)))","v":""},{"$f":"IF(C4=\"\",\"\",VLOOKUP(VLOOKUP($B$2,Rates!$A$72:$S$106,19,0),'PCIA  FF'!$A:$O,MATCH(MAX('PCIA  FF'!$1:$1),'PCIA  FF'!$1:$1,0),0)+VLOOKUP(VLOOKUP($B$2,Rates!$A$72:$S$106,19,0),'PCIA  FF'!$14:$24,MATCH(MAX('PCIA  FF'!$1:$1),'PCIA  FF'!$1:$1,0),0))","v":""},{"$f":"IF(SUM(C4:E4)=0,\"\",SUM(C4:E4))","v":""},{"$f":"IF(INDEX(Rates!$A$2:$J$35,MATCH('Rebundled Rates'!$B$2,Rates!$A$2:$A$35,0),MATCH('Rebundled Rates'!B4,Rates!$2:$2,0))=FALSE,\"\",INDEX(Rates!$A$2:$J$35,MATCH('Rebundled Rates'!$B$2,Rates!$A$2:$A$35,0),MATCH('Rebundled Rates'!B4,Rates!$2:$2,0)))","v":""},{"$f":"IFERROR((F4/G4)-1,\"\")","v":""}]
["Non-TOU",{"$f":"Rates!C2","v":"Summer"},{"$f":"IF(INDEX(Rates!$A$73:$J$106,MATCH($B$2,Rates!$A$73:$A$106,0),MATCH('Rebundled Rates'!B5,Rates!$2:$2,0))=FALSE,\"\",INDEX(Rates!$A$73:$J$106,MATCH($B$2,Rates!$A$73:$A$106,0),MATCH('Rebundled Rates'!B5,Rates!$2:$2,0)))","v":""},{"$f":"IF(INDEX(Rates!$A$38:$J$69,MATCH('Rebundled Rates'!$B$2,Rates!$A$2:$A$35,0),MATCH('Rebundled Rates'!B5,Rates!$2:$2,0))=FALSE,\"\",G5-INDEX(Rates!$A$38:$J$69,MATCH('Rebundled Rates'!$B$2,Rates!$A$2:$A$35,0),MATCH('Rebundled Rates'!B5,Rates!$2:$2,0)))","v":""},{"$f":"IF(C5=\"\",\"\",VLOOKUP(VLOOKUP($B$2,Rates!$A$72:$S$106,19,0),'PCIA  FF'!$A:$O,MATCH(MAX('PCIA  FF'!$1:$1),'PCIA  FF'!$1:$1,0),0)+VLOOKUP(VLOOKUP($B$2,Rates!$A$72:$S$106,19,0),'PCIA  FF'!$14:$24,MATCH(MAX('PCIA  FF'!$1:$1),'PCIA  FF'!$1:$1,0),0))","v":""},{"$f":"IF(SUM(C5:E5)=0,\"\",SUM(C5:E5))","v":""},{"$f":"IF(INDEX(Rates!$A$2:$J$35,MATCH('Rebundled Rates'!$B$2,Rates!$A$2:$A$35,0),MATCH('Rebundled Rates'!B5,Rates!$2:$2,0))=FALSE,\"\",INDEX(Rates!$A$2:$J$35,MATCH('Rebundled Rates'!$B$2,Rates!$A$2:$A$35,0),MATCH('Rebundled Rates'!B5,Rates!$2:$2,0)))","v":""},{"$f":"IFERROR((F5/G5)-1,\"\")","v":""}]
["Non-TOU",{"$f":"Rates!D2","v":"Winter"},{"$f":"IF(INDEX(Rates!$A$73:$J$106,MATCH($B$2,Rates!$A$73:$A$106,0),MATCH('Rebundled Rates'!B6,Rates!$2:$2,0))=FALSE,\"\",INDEX(Rates!$A$73:$J$106,MATCH($B$2,Rates!$A$73:$A$106,0),MATCH('Rebundled Rates'!B6,Rates!$2:$2,0)))","v":""},{"$f":"IF(INDEX(Rates!$A$38:$J$69,MATCH('Rebundled Rates'!$B$2,Rates!$A$2:$A$35,0),MATCH('Rebundled Rates'!B6,Rates!$2:$2,0))=FALSE,\"\",G6-INDEX(Rates!$A$38:$J$69,MATCH('Rebundled Rates'!$B$2,Rates!$A$2:$A$35,0),MATCH('Rebundled Rates'!B6,Rates!$2:$2,0)))","v":""},{"$f":"IF(C6=\"\",\"\",VLOOKUP(VLOOKUP($B$2,Rates!$A$72:$S$106,19,0),'PCIA  FF'!$A:$O,MATCH(MAX('PCIA  FF'!$1:$1),'PCIA  FF'!$1:$1,0),0)+VLOOKUP(VLOOKUP($B$2,Rates!$A$72:$S$106,19,0),'PCIA  FF'!$14:$24,MATCH(MAX('PCIA  FF'!$1:$1),'PCIA  FF'!$1:$1,0),0))","v":""},"",{"$f":"IF(INDEX(Rates!$A$2:$J$35,MATCH('Rebundled Rates'!$B$2,Rates!$A$2:$A$35,0),MATCH('Rebundled Rates'!B6,Rates!$2:$2,0))=FALSE,\"\",INDEX(Rates!$A$2:$J$35,MATCH('Rebundled Rates'!$B$2,Rates!$A$2:$A$35,0),MATCH('Rebundled Rates'!B6,Rates!$2:$2,0)))","v":""},""]
["TOU Usage",{"$f":"Rates!E2","v":"Summer Peak"},{"$f":"IF(INDEX(Rates!$A$73:$J$106,MATCH($B$2,Rates!$A$73:$A$106,0),MATCH('Rebundled Rates'!B7,Rates!$2:$2,0))=FALSE,\"\",INDEX(Rates!$A$73:$J$106,MATCH($B$2,Rates!$A$73:$A$106,0),MATCH('Rebundled Rates'!B7,Rates!$2:$2,0)))","v":0.10691000000000001},{"$f":"IF(INDEX(Rates!$A$38:$J$69,MATCH('Rebundled Rates'!$B$2,Rates!$A$2:$A$35,0),MATCH('Rebundled Rates'!B7,Rates!$2:$2,0))=FALSE,\"\",G7-INDEX(Rates!$A$38:$J$69,MATCH('Rebundled Rates'!$B$2,Rates!$A$2:$A$35,0),MATCH('Rebundled Rates'!B7,Rates!$2:$2,0)))","v":0.13211999999999999},{"$f":"IF(C7=\"\",\"\",VLOOKUP(VLOOKUP($B$2,Rates!$A$72:$S$106,19,0),'PCIA  FF'!$A:$O,MATCH(MAX('PCIA  FF'!$1:$1),'PCIA  FF'!$1:$1,0),0)+VLOOKUP(VLOOKUP($B$2,Rates!$A$72:$S$106,19,0),'PCIA  FF'!$14:$24,MATCH(MAX('PCIA  FF'!$1:$1),'PCIA  FF'!$1:$1,0),0))","v":2.264E-2},{"$f":"IF(SUM(C7:E7)=0,\"\",SUM(C7:E7))","v":0.26167000000000001},{"$f":"IF(INDEX(Rates!$A$2:$J$35,MATCH('Rebundled Rates'!$B$2,Rates!$A$2:$A$35,0),MATCH('Rebundled Rates'!B7,Rates!$2:$2,0))=FALSE,\"\",INDEX(Rates!$A$2:$J$35,MATCH('Rebundled Rates'!$B$2,Rates!$A$2:$A$35,0),MATCH('Rebundled Rates'!B7,Rates!$2:$2,0)))","v":0.26297999999999999},{"$f":"IFERROR((F7/G7)-1,\"\")","v":-4.9813674043652778E-3}]
["TOU Usage",{"$f":"Rates!F2","v":"Summer Partial Peak"},{"$f":"IF(INDEX(Rates!$A$73:$J$106,MATCH($B$2,Rates!$A$73:$A$106,0),MATCH('Rebundled Rates'!B8,Rates!$2:$2,0))=FALSE,\"\",INDEX(Rates!$A$73:$J$106,MATCH($B$2,Rates!$A$73:$A$106,0),MATCH('Rebundled Rates'!B8,Rates!$2:$2,0)))","v":8.3500000000000005E-2},{"$f":"IF(INDEX(Rates!$A$38:$J$69,MATCH('Rebundled Rates'!$B$2,Rates!$A$2:$A$35,0),MATCH('Rebundled Rates'!B8,Rates!$2:$2,0))=FALSE,\"\",G8-INDEX(Rates!$A$38:$J$69,MATCH('Rebundled Rates'!$B$2,Rates!$A$2:$A$35,0),MATCH('Rebundled Rates'!B8,Rates!$2:$2,0)))","v":0.13211999999999999},{"$f":"IF(C8=\"\",\"\",VLOOKUP(VLOOKUP($B$2,Rates!$A$72:$S$106,19,0),'PCIA  FF'!$A:$O,MATCH(MAX('PCIA  FF'!$1:$1),'PCIA  FF'!$1:$1,0),0)+VLOOKUP(VLOOKUP($B$2,Rates!$A$72:$S$106,19,0),'PCIA  FF'!$14:$24,MATCH(MAX('PCIA  FF'!$1:$1),'PCIA  FF'!$1:$1,0),0))","v":2.264E-2},{"$f":"IF(SUM(C8:E8)=0,\"\",SUM(C8:E8))","v":0.23825999999999997},{"$f":"IF(INDEX(Rates!$A$2:$J$35,MATCH('Rebundled Rates'!$B$2,Rates!$A$2:$A$35,0),MATCH('Rebundled Rates'!B8,Rates!$2:$2,0))=FALSE,\"\",INDEX(Rates!$A$2:$J$35,MATCH('Rebundled Rates'!$B$2,Rates!$A$2:$A$35,0),MATCH('Rebundled Rates'!B8,Rates!$2:$2,0)))","v":0.23932999999999999},{"$f":"IFERROR((F8/G8)-1,\"\")","v":-4.4708143567460112E-3}]
["TOU Usage",{"$f":"Rates!G2","v":"Summer Off Peak"},{"$f":"IF(INDEX(Rates!$A$73:$J$106,MATCH($B$2,Rates!$A$73:$A$106,0),MATCH('Rebundled Rates'!B9,Rates!$2:$2,0))=FALSE,\"\",INDEX(Rates!$A$73:$J$106,MATCH($B$2,Rates!$A$73:$A$106,0),MATCH('Rebundled Rates'!B9,Rates!$2:$2,0)))","v":5.6410000000000002E-2},{"$f":"IF(INDEX(Rates!$A$38:$J$69,MATCH('Rebundled Rates'!$B$2,Rates!$A$2:$A$35,0),MATCH('Rebundled Rates'!B9,Rates!$2:$2,0))=FALSE,\"\",G9-INDEX(Rates!$A$38:$J$69,MATCH('Rebundled Rates'!$B$2,Rates!$A$2:$A$35,0),MATCH('Rebundled Rates'!B9,Rates!$2:$2,0)))","v":0.13211999999999999},{"$f":"IF(C9=\"\",\"\",VLOOKUP(VLOOKUP($B$2,Rates!$A$72:$S$106,19,0),'PCIA  FF'!$A:$O,MATCH(MAX('PCIA  FF'!$1:$1),'PCIA  FF'!$1:$1,0),0)+VLOOKUP(VLOOKUP($B$2,Rates!$A$72:$S$106,19,0),'PCIA  FF'!$14:$24,MATCH(MAX('PCIA  FF'!$1:$1),'PCIA  FF'!$1:$1,0),0))","v":2.264E-2},0.21116999999999997,{"$f":"IF(INDEX(Rates!$A$2:$J$35,MATCH('Rebundled Rates'!$B$2,Rates!$A$2:$A$35,0),MATCH('Rebundled Rates'!B9,Rates!$2:$2,0))=FALSE,\"\",INDEX(Rates!$A$2:$J$35,MATCH('Rebundled Rates'!$B$2,Rates!$A$2:$A$35,0),MATCH('Rebundled Rates'!B9,Rates!$2:$2,0)))","v":0.21196999999999999},-3.7741189791009599E-3]
["TOU Usage",{"$f":"Rates!H2","v":"Winter Peak"},{"$f":"IF(INDEX(Rates!$A$73:$J$106,MATCH($B$2,Rates!$A$73:$A$106,0),MATCH('Rebundled Rates'!B10,Rates!$2:$2,0))=FALSE,\"\",INDEX(Rates!$A$73:$J$106,MATCH($B$2,Rates!$A$73:$A$106,0),MATCH('Rebundled Rates'!B10,Rates!$2:$2,0)))","v":""},{"$f":"IF(INDEX(Rates!$A$38:$J$69,MATCH('Rebundled Rates'!$B$2,Rates!$A$2:$A$35,0),MATCH('Rebundled Rates'!B10,Rates!$2:$2,0))=FALSE,\"\",G10-INDEX(Rates!$A$38:$J$69,MATCH('Rebundled Rates'!$B$2,Rates!$A$2:$A$35,0),MATCH('Rebundled Rates'!B10,Rates!$2:$2,0)))","v":""},{"$f":"IF(C10=\"\",\"\",VLOOKUP(VLOOKUP($B$2,Rates!$A$72:$S$106,19,0),'PCIA  FF'!$A:$O,MATCH(MAX('PCIA  FF'!$1:$1),'PCIA  FF'!$1:$1,0),0)+VLOOKUP(VLOOKUP($B$2,Rates!$A$72:$S$106,19,0),'PCIA  FF'!$14:$24,MATCH(MAX('PCIA  FF'!$1:$1),'PCIA  FF'!$1:$1,0),0))","v":""},"",{"$f":"IF(INDEX(Rates!$A$2:$J$35,MATCH('Rebundled Rates'!$B$2,Rates!$A$2:$A$35,0),MATCH('Rebundled Rates'!B10,Rates!$2:$2,0))=FALSE,\"\",INDEX(Rates!$A$2:$J$35,MATCH('Rebundled Rates'!$B$2,Rates!$A$2:$A$35,0),MATCH('Rebundled Rates'!B10,Rates!$2:$2,0)))","v":""},""]
{"$rows_left_out":11}
{"sheet":"Changelog","index":6,"n_rows":15,"n_cols":2,"rows_kept":15,"cut":false,"hidden":true,"merged":[]}
["2016-11-15","Added Changelog"]
[null,"Added lbs or metric tons for CO2 switch"]
[null,"Changed CO2e description to CO2 (due to recently discovered information that PG&E emissions only includes CO2 and omits other equivalent gasses which would increase their emissions factor)"]
["2017-01-03","Updated for PG&E AET"]
[null,"Fixed AG-1 A/B maximum demand defect"]
[null,"Fixed AG-4 C demand component defect"]
["2017-03-01","Updated PCIA methodology"]
[null,"Addressed PG&E Solar Choice Calculation issues"]
[null,"Updated PG&E Solar Choice Rates"]
[null,"Updated rates to PG&E 3/1 rate change"]
{"$rows_left_out":5}